{"text_format":"1","workbook":"xlsx","n_sheets":5,"sheets":["Spectrum","Data","work","Constants","Derivation"],"not_rendered":{"charts":2,"images":1,"macros":1,"external_links":0,"defined_names":51,"comments":0,"pivot_tables":0},"unopened":[{"sheet":"Spectrum","index":0,"reason":"not_a_worksheet"}],"bounds":{"document_bytes":16777216,"sheet_cells":100000,"rows_first":2000,"rows_last":500,"rows_between":2000,"halvings":0,"cell_chars":16384,"cell_head_chars":4096},"cells_cut":0,"cells_raw":0,"read":"whole","date_system":"1900"}

{"sheet":"Data","index":1,"n_rows":46,"n_cols":23,"rows_kept":46,"cut":false,"hidden":false,"merged":[[0,14,0,15],[0,16,0,17],[0,8,0,9],[0,10,0,11],[0,12,0,13],[38,21,38,22],[38,23,38,24],[0,20,0,21],[0,22,0,23],[0,18,0,19],[38,19,38,20]]}
["n (cm-1)","A",null,0,null,null,null,null,"D35Cl",null,"D37Cl",null,"H35Cl",null,"H37Cl",null,"D35Cl(ot)",null,"D37Cl(ot)",null,"H35Cl(ot)",null,"H37Cl(ot)"]
[null,null,null,0]
[]
[]
[]
[]
[]
[]
[]
[]
[]
[]
[]
[]
[]
[]
[]
[]
[]
[]
[]
[]
[]
[]
[]
[]
[]
[]
[]
[]
[]
[]
[]
[]
[null,null,null,null,null,null,null,null,"D="]
[null,null,null,null,null,null,null,null,"C="]
[null,null,null,null,null,null,null,null,"B="]
[null,null,null,null,null,null,null,null,"A="]
[]
[null,null,null,null,null,null,null,null,"ae = ",null,"cm-1"]
[null,null,null,null,null,null,null,null,"n0 =",null,"cm-1"]
[null,null,null,null,null,null,null,null,"Be =",null,"cm-1"]
[null,null,null,null,null,null,null,null,"Ie =",null,"kgm2"]
[null,null,null,null,null,null,null,null,"Re =",null,"m"]
[null,null,null,null,null,null,null,null,"k =",null,"N/m"]
[null,null,null,null,null,null,null,null,"D = ",null,"cm-1"]

{"sheet":"work","index":2,"n_rows":13,"n_cols":4,"rows_kept":13,"cut":false,"hidden":false,"merged":[[0,0,3,0],[4,0,7,0]]}
["Data","xmin:",{"$f":"MIN(Data!A2:'Data'!A14118)","v":0}]
[null,"xmax:",{"$f":"MAX(Data!A2:'Data'!A14118)","v":0}]
[null,"ymin:",{"$f":"MIN(Data!B2:'Data'!B14118)","v":0}]
[null,"ymax:",{"$f":"MAX(Data!B2:'Data'!B14118)","v":0}]
["Graph","xmin:",800]
[null,"xmax:",6000]
[null,"ymin:",-0.1]
[null,"ymax:",1.2]
[null,"Data counter",14118]
["SubData","xmin:",1900,{"$f":"MATCH(C10,Data!A1:A14118,-1)","v":{"$error":"#N/A"}}]
[null,"xmax:",2300,{"$f":"MATCH(C11,Data!A1:A14118,-1)","v":{"$error":"#N/A"}}]
[null,"ymin:",{"$f":"MIN(Data!B10446:B11576)","v":0}]
[null,"ymax:",{"$f":"MAX(Data!B10446:B11576)","v":0}]

{"sheet":"Constants","index":3,"n_rows":11,"n_cols":8,"rows_kept":11,"cut":false,"hidden":false,"merged":[]}
[null,null,null,null,null,"mH =",1.007825]
[null,null,null,null,null,"mD =",2.0141019999999998]
[null,null,null,null,null,"m35Cl =",34.968853000000003]
[null,null,null,null,null,"m37Cl =",36.965902999999997]
[null,null,null,null,null,"mH35Cl =",{"$f":"m_H*m_35Cl/(m_H+m_35Cl)","v":0.97959250920068275}]
[null,null,null,null,null,"mD35Cl =",{"$f":"m_D*m_35Cl/(m_D+m_35Cl)","v":1.9044134457348256}]
[null,null,null,null,null,"mH37Cl =",{"$f":"m_H*m_37Cl/(m_H+m_37Cl)","v":0.98107726454919042}]
[null,null,null,null,null,"mD37Cl =",{"$f":"m_D*m_37Cl/(m_D+m_37Cl)","v":1.9100330839902662}]
[null,null,null,null,null,"h =",6.6260760000000001E-34,"Js"]
[null,null,null,null,null,"c =",300000000,"m/s"]
[null,null,null,null,null,"mr =",{"$f":"0.001/6.023E+23","v":1.6603021749958494E-27},"kg/amu"]

{"sheet":"Derivation","index":4,"n_rows":0,"n_cols":0,"rows_kept":0,"cut":false,"hidden":false,"merged":[]}